-- The C compiler identification is Clang 9.0.1
-- The CXX compiler identification is Clang 9.0.1
-- Check for working C compiler: /gnu/store/yps6bghy12wjnk8j417snv08zniyfp12-clang-toolchain-9.0.1/bin/clang
-- Check for working C compiler: /gnu/store/yps6bghy12wjnk8j417snv08zniyfp12-clang-toolchain-9.0.1/bin/clang -- broken
CMake Error at /gnu/store/3dsl2jalrcyldkrsqab1hc6sv8pyag9z-cmake-minimal-3.16.5/share/cmake-3.16/Modules/CMakeTestCCompiler.cmake:60 (message):
  The C compiler

    "/gnu/store/yps6bghy12wjnk8j417snv08zniyfp12-clang-toolchain-9.0.1/bin/clang"

  is not able to compile a simple test program.

  It fails with the following output:

    Change Dir: /tmp/guix-build-irods-4.2.8.drv-0/build/CMakeFiles/CMakeTmp
    
    Run Build Command(s):/gnu/store/hm40bxnv8jxmbc1lpb7zfimii4xm9m81-make-4.3/bin/make cmTC_40820/fast && /gnu/store/hm40bxnv8jxmbc1lpb7zfimii4xm9m81-make-4.3/bin/make -f CMakeFiles/cmTC_40820.dir/build.make CMakeFiles/cmTC_40820.dir/build
    make[1]: Entering directory '/tmp/guix-build-irods-4.2.8.drv-0/build/CMakeFiles/CMakeTmp'
    Building C object CMakeFiles/cmTC_40820.dir/testCCompiler.c.o
    /gnu/store/yps6bghy12wjnk8j417snv08zniyfp12-clang-toolchain-9.0.1/bin/clang    -o CMakeFiles/cmTC_40820.dir/testCCompiler.c.o   -c /tmp/guix-build-irods-4.2.8.drv-0/build/CMakeFiles/CMakeTmp/testCCompiler.c
    Linking C executable cmTC_40820
    /gnu/store/3dsl2jalrcyldkrsqab1hc6sv8pyag9z-cmake-minimal-3.16.5/bin/cmake -E cmake_link_script CMakeFiles/cmTC_40820.dir/link.txt --verbose=1
    /gnu/store/yps6bghy12wjnk8j417snv08zniyfp12-clang-toolchain-9.0.1/bin/clang    -stdlib=libc++ -lstdc++  CMakeFiles/cmTC_40820.dir/testCCompiler.c.o  -o cmTC_40820 
    ld: /gnu/store/y8dgmh1bmgjhx7rr2b8jgm09sjnl51jz-libcxx-9.0.1/lib/libc++.so: undefined reference to `__cxa_free_exception'
    ld: /gnu/store/y8dgmh1bmgjhx7rr2b8jgm09sjnl51jz-libcxx-9.0.1/lib/libc++.so: undefined reference to `__cxa_begin_catch'
    ld: /gnu/store/y8dgmh1bmgjhx7rr2b8jgm09sjnl51jz-libcxx-9.0.1/lib/libc++.so: undefined reference to `__cxa_guard_release'
    ld: /gnu/store/y8dgmh1bmgjhx7rr2b8jgm09sjnl51jz-libcxx-9.0.1/lib/libc++.so: undefined reference to `__cxa_call_unexpected'
    ld: /gnu/store/y8dgmh1bmgjhx7rr2b8jgm09sjnl51jz-libcxx-9.0.1/lib/libc++.so: undefined reference to `__cxa_pure_virtual'
    ld: /gnu/store/y8dgmh1bmgjhx7rr2b8jgm09sjnl51jz-libcxx-9.0.1/lib/libc++.so: undefined reference to `__cxa_allocate_exception'
    ld: /gnu/store/y8dgmh1bmgjhx7rr2b8jgm09sjnl51jz-libcxx-9.0.1/lib/libc++.so: undefined reference to `__gxx_personality_v0'
    ld: /gnu/store/y8dgmh1bmgjhx7rr2b8jgm09sjnl51jz-libcxx-9.0.1/lib/libc++.so: undefined reference to `__cxa_throw'
    ld: /gnu/store/y8dgmh1bmgjhx7rr2b8jgm09sjnl51jz-libcxx-9.0.1/lib/libc++.so: undefined reference to `__cxa_guard_abort'
    ld: /gnu/store/y8dgmh1bmgjhx7rr2b8jgm09sjnl51jz-libcxx-9.0.1/lib/libc++.so: undefined reference to `__cxa_end_catch'
    ld: /gnu/store/y8dgmh1bmgjhx7rr2b8jgm09sjnl51jz-libcxx-9.0.1/lib/libc++.so: undefined reference to `__cxa_guard_acquire'
    ld: /gnu/store/y8dgmh1bmgjhx7rr2b8jgm09sjnl51jz-libcxx-9.0.1/lib/libc++.so: undefined reference to `vtable for __cxxabiv1::__vmi_class_type_info'
    ld: /gnu/store/y8dgmh1bmgjhx7rr2b8jgm09sjnl51jz-libcxx-9.0.1/lib/libc++.so: undefined reference to `vtable for __cxxabiv1::__class_type_info'
    ld: /gnu/store/y8dgmh1bmgjhx7rr2b8jgm09sjnl51jz-libcxx-9.0.1/lib/libc++.so: undefined reference to `__cxa_rethrow'
    ld: /gnu/store/y8dgmh1bmgjhx7rr2b8jgm09sjnl51jz-libcxx-9.0.1/lib/libc++.so: undefined reference to `vtable for __cxxabiv1::__si_class_type_info'
    clang-9: error: linker command failed with exit code 1 (use -v to see invocation)
    make[1]: *** [CMakeFiles/cmTC_40820.dir/build.make:87: cmTC_40820] Error 1
    make[1]: Leaving directory '/tmp/guix-build-irods-4.2.8.drv-0/build/CMakeFiles/CMakeTmp'
    make: *** [Makefile:121: cmTC_40820/fast] Error 2
    
    

  

  CMake will not be able to correctly generate this project.
Call Stack (most recent call first):
  CMakeLists.txt:58 (project)


-- Configuring incomplete, errors occurred!
See also "/tmp/guix-build-irods-4.2.8.drv-0/build/CMakeFiles/CMakeOutput.log".
See also "/tmp/guix-build-irods-4.2.8.drv-0/build/CMakeFiles/CMakeError.log".
command "cmake" "../irods-4.2.8" "-DCMAKE_BUILD_TYPE=RelWithDebInfo" "-DCMAKE_INSTALL_PREFIX=/gnu/store/bk9975qgnh435rc7983gbgsgk6gd5xxs-irods-4.2.8" "-DCMAKE_INSTALL_LIBDIR=lib" "-DCMAKE_INSTALL_RPATH_USE_LINK_PATH=TRUE" "-DCMAKE_INSTALL_RPATH=/gnu/store/bk9975qgnh435rc7983gbgsgk6gd5xxs-irods-4.2.8/lib" "-DCMAKE_VERBOSE_MAKEFILE=ON" "-DCPACK_GENERATOR=TGZ" "-DIRODS_LINUX_DISTRIBUTION_NAME=guix" "-DIRODS_LINUX_DISTRIBUTION_VERSION_MAJOR=1" "-DIRODS_EXTERNALS_FULLPATH_CLANG=/gnu/store/yps6bghy12wjnk8j417snv08zniyfp12-clang-toolchain-9.0.1" "-DIRODS_EXTERNALS_FULLPATH_CLANG_RUNTIME=/gnu/store/lcs30savnj93ic9c560m1a8mlifac6ih-clang-runtime-9.0.1" "-DIRODS_EXTERNALS_FULLPATH_CPPZMQ=/gnu/store/h5wbk8g5h6vhvm1kg5rblwcw86l27yz9-cppzmq-4.6.0" "-DIRODS_EXTERNALS_FULLPATH_ARCHIVE=/gnu/store/zsdy03jywqs252ik3p3576cmbhnc0ddi-libarchive-3.4.2" "-DIRODS_EXTERNALS_FULLPATH_AVRO=/gnu/store/fsmmjq328amwqflq5cxbd9hl2rbg5rz6-avro-cpp-1.9.2" "-DIRODS_EXTERNALS_FULLPATH_BOOST=/gnu/store/kxabg9r2wnb4inc5lvh7r4wxnpj5f8kr-boost-1.72.0" "-DIRODS_EXTERNALS_FULLPATH_ZMQ=/gnu/store/zd9lbfqa3170nsfd4177dnr38k1sjbnc-zeromq-4.3.4" "-DIRODS_EXTERNALS_FULLPATH_JSON=/gnu/store/3dfxcxgklaq2v941rbckh7ac8xkyj96q-json-modern-cxx-3.9.1" "-DIRODS_EXTERNALS_FULLPATH_SPDLOG=/gnu/store/c8xggk5x8af033py9zalwm8rqbi7ipg1-spdlog-1.8.5" "-DIRODS_EXTERNALS_FULLPATH_CATCH2=/gnu/store/mlg4hh2rv70f8wyasxxr0p6ysakjhh2q-catch2-2.13.2" "-DIRODS_EXTERNALS_FULLPATH_NANODBC=/gnu/store/m9mmbzass7xj1b6rc5v4yy6fny9knq2q-nanodbc-2.13.0" "-DIRODS_EXTERNALS_FULLPATH_FMT=/gnu/store/vw9pmxwwmmdsv764lbyxy26g3b4zd01p-fmt-7.1.3" failed with status 1
builder for `/gnu/store/ia9d1z0p8prgbq8cq6ncfzy6n185gzc3-irods-4.2.8.drv' failed with exit code 1
build of /gnu/store/ia9d1z0p8prgbq8cq6ncfzy6n185gzc3-irods-4.2.8.drv failed
View build log at '/var/log/guix/drvs/ia/9d1z0p8prgbq8cq6ncfzy6n185gzc3-irods-4.2.8.drv.bz2'.
guix build: error: build of `/gnu/store/ia9d1z0p8prgbq8cq6ncfzy6n185gzc3-irods-4.2.8.drv' failed

Generated by Ricardo Wurmus using scpaste at Tue Apr 20 17:04:06 2021. CEST. (original)